{"text_format":"1","workbook":"xlsx","n_sheets":18,"sheets":["identifikacija_obrazca","navodila","stranka","pooblasc","izjava o ne eVročanju","1_podatki_o_napravi","2_umestitev","3_nenevar_in_nev_odp","4_po_obdelavi_nastalo","5_obvezne_priloge","6_druga_dokazila","up_taksa","sifrant_odpadkov","sifrant_obcine","sifrant_ostalo","sifrant_prilog","ODP_sifrant_r_d","prevent_share"],"not_rendered":{"charts":0,"images":1,"macros":1,"external_links":0,"defined_names":147,"comments":4,"pivot_tables":0},"unopened":[],"bounds":{"document_bytes":16777216,"sheet_cells":100000,"rows_first":2000,"rows_last":500,"rows_between":2000,"halvings":0,"cell_chars":16384,"cell_head_chars":4096},"cells_cut":0,"cells_raw":0,"read":"whole","date_system":"1900"}

{"sheet":"identifikacija_obrazca","index":0,"n_rows":59,"n_cols":4,"rows_kept":59,"cut":false,"hidden":true,"merged":[[62,3,62,18],[63,3,63,18],[64,3,64,18],[56,3,56,18],[57,3,57,18],[58,3,58,18],[59,3,59,18],[60,3,60,18],[52,3,52,18],[53,3,53,18],[54,3,54,18],[55,3,55,18],[61,3,61,18],[47,3,47,18],[48,3,48,18],[49,3,49,18],[50,3,50,18],[51,3,51,18],[42,3,42,18],[43,3,43,18],[44,3,44,18],[45,3,45,18],[46,3,46,18],[37,3,37,18],[38,3,38,18],[39,3,39,18],[40,3,40,18],[41,3,41,18],[32,3,32,18],[33,3,33,18],[34,3,34,18],[35,3,35,18],[36,3,36,18],[27,3,27,18],[28,3,28,18],[29,3,29,18],[30,3,30,18],[31,3,31,18],[21,3,21,18],[22,3,22,18],[25,3,25,18],[26,3,26,18],[23,3,23,18],[24,3,24,18],[16,3,16,18],[17,3,17,18],[19,3,19,18],[20,3,20,18],[11,3,11,18],[12,3,12,18],[13,3,13,18],[14,3,14,18],[15,3,15,18],[0,0,0,14],[5,1,5,14],[8,3,8,18],[9,3,9,18],[10,3,10,18]]}
["Pozor: ti podatki so namenjeni identifikaciji obrazca. Vsaka oseba iz ARSO ali izvajalec za ARSO, ki spreminja elemente v tem obrazcu je dolžan uskladiti številko verzije, dopisati sprremembe in podake o avtorju sprememb in skoordinirati, da se ta verzija odloži na za to predvideno mesto. Prav tako je dolžan skoordinirati, da so o novi verziji obveščene ustrezne osebe."]
["Tip obrazca:","VLOGA_ZBIRALEC",null,"Ta naziv za ta tip vloge ostane vedno isti"]
["Verzija:","1.12",null,"To verzijo je potrebno spremeniti, če se delajo spremembe obrazca (če samo spremembe label, se poviša le druga številka, če kakršnekoli strukturne spremembe ali kontrole, se poviša prva)"]
["Datum zadnje spremembe:","2016-10-27",null,"To je potrebno spremeniti ob spremembi"]
["Oseba, ki je izvedla zadnjo spremembo","Sašo Celarc"]
[]
[]
["Opis sprememb:","Sašo Celarc","2016-09-26","Dopolnil tehnične elemnte za spustne sezname, kontrole, …."]
[null,"Sašo Celarc","2016-09-27","Stvari, ki jih je Marjana napisala v mailu  27 September, 2016 09:43:\nNa strani prosilec uredil izbor za \"Registracija za izvajanje dejavnosti zbiranja in odvoza odpadkov\", da je enak izbor kot pri ostalih spustnih seznamih. Šifrant teh treh vrednosti\npremaknil na zavihek sifrant_ostalo in jih odstranil iz prosilec.\nNa zavihku 2_umestitev_zc odstranil združitev stolpcev tam, kjer se vnaša"]
[null,"Sašo Celarc","2016-10-04","Na zavihku prosilec in pooblasc postavil format za polji, kjer je telefonska številka na Text, ker sicer izginejo vodilne 0."]
[null,"Sašo Celarc","2016-10-10","Na zavihku sifrant_ostalo popravil \"Registracija za izvajanje dejavnosti zbiranja in odvoza odpadkov\", kjer sem odstranil presledek, ki je bil odspredaj"]
[null,"Sašo Celarc","2016-10-10","Na zavihkih 1_zb_center2 in 1_zb_center3 popravil zaporedno številko zbirnega centra v J4 na 2 in 3, da ne navajata uporabnika, da se vsi trije zavihki nanašajo na zaporedno številko 1"]
[null,"Sašo Celarc","2016-10-11","Na zavihku obvezne_priloge odstranil stolpec številko zbirnega centra"]
[null,"Sašo Celarc","2016-10-11","Na zavihku up_taksa za celico H21, ki pomeni datum, postavl validacijo na datum med 1.1.2016 in 1.1.2050"]
[null,"Sašo Celarc","2016-10-11","Naredil range SIFRANT_TIPOV_REGISTRACIJ in nanj vezal VLOOKUP za tip registracije na zavihku prosilec - v celici O24. Stolpec O sem dal na hidden."]
{"$rows_left_out":45}
{"sheet":"navodila","index":1,"n_rows":63,"n_cols":2,"rows_kept":63,"cut":false,"hidden":true,"merged":[[1,0,1,1]]}
[]
["Navodila  za izpolnjevanje obrazca VLOGA ZA PRIDOBITEV/SPREMEMBO POTRDILA O VPISU V EVIDENCO ZBIRALCEV ODPADKOV"]
[]
["Zakonodajna osnova"]
[null,"30. člen Uredbe o odpadkih (UL RS, št. 37/15 in 69/15) določa, da zbiralec lahko zbira odpadke, če ima potrdilo o vpisu v evidenco zbiralcev odpadkov. Vloga za vpis v evidenco zbiralcev odpadkov se vloži na podlagi določb 31. člena v povezavi s 30. členom navedenega predpisa. Zbiralec mora spremembo imena ali naslova oziroma firme ali sedeža, ali spremembo glede vrste odpadkov, ki jih zbira, glede skupne količine odpadkov ali skupne količine nevarnih odpadkov, ki jih predhodno skladišči ali glede kraja ali zmogljivosti zbirnega centra prijaviti z vlogo na podlagi določb 34. člena navedenega predpisa. "]
["Namen"]
[null,"Obrazec je namenjen pripravi vloge za pridobitev/spremembo potrdila o vpisu v evidenco zbiralcev odpadkov, ki jo vodi ministrstvo v okviru evidence oseb, ki imajo potrdilo za opravljanje dejavnosti varstva okolja, v skladu z zakonom, ki ureja varstvo okolja."]
["Definicije pojmov, uporabljenih v obrazcu"]
[null,"Vsebina obrazca je usklajena s tistimi določili 30., 31. in 34. člena Uredbe o odpadkih (UL RS, št. 37/15 in 69/15), ki določajo vsebino vloge za pridobitev potrdila o vpisu v evidenco zbiralcev odpadkov oziroma vloge za spremembo potrdila o vpisu v evidenco zbiralcev odpadkov."]
[]
["Splošna navodila za izpolnjevanje obrazca"]
[null,"Obrazec, ki je dostopen na spletni strani Agencije RS za okolje (http://www.arso.gov.si/varstvo%20okolja/odpadki/obrazci/) pod rubriko \"Ravnanje z odpadki - splošno\" shranite na svoj računalnik. "]
[null,"Kliknite na gumb Omogoči vsebino poleg varnostnega opozorila pod menijsko vrstico, da omogočite izvajanje makrojev, če to ni omogočeno. Potrdite, da želite spremeniti to datoteko v zaupanja vreden dokument."]
[null,"Navedeni podatki v obrazcu vloge naj izkazujejo stanje glede števila lokacij in zmogljivosti zbirnih centrov in glede števila in vrste odpadkov ter občin (za izvajalce obvezne občinske gospodarske javne službe) za pridobitev 1.potrdila o vpisu v evidenco zbiralcev odpadkov oziroma stanje po 1. spremembi potrdila oz. stanje po nadaljnjih spremembah potrdila."]
[null,"Vnos podatkov je mogoč le v celice, ki nimajo senčenega ozadja."]
{"$rows_left_out":49}
{"sheet":"stranka","index":2,"n_rows":46,"n_cols":10,"rows_kept":46,"cut":false,"hidden":false,"merged":[[40,1,40,13],[41,1,41,13],[42,1,42,13],[36,1,36,3],[36,4,36,13],[37,1,37,3],[37,4,37,13],[39,1,39,13],[33,1,33,13],[34,1,34,3],[34,4,34,8],[34,9,34,13],[35,1,35,3],[35,4,35,13],[14,1,14,3],[14,4,14,13],[16,2,16,3],[23,10,23,13],[19,2,19,3],[19,4,19,13],[20,10,20,13],[9,1,9,13],[10,1,10,13],[11,1,11,13],[13,1,13,3],[13,4,13,13],[12,1,12,13],[27,2,27,3],[22,4,22,13],[25,4,25,13],[26,4,26,13],[27,4,27,13],[24,4,24,13],[25,1,25,3],[26,2,26,3],[31,1,31,7],[31,8,31,13],[29,1,29,7],[29,8,29,13],[28,1,28,7],[0,1,8,13],[28,8,28,13],[30,1,30,7],[30,8,30,13],[15,4,15,13],[15,2,15,3],[21,1,21,3],[21,4,21,13],[16,4,16,13],[18,2,18,3],[18,4,18,13],[17,2,17,3],[17,4,17,13],[22,1,22,3],[24,1,24,3],[23,1,23,9]]}
[]
[]
[]
[]
[]
[]
[]
[]
[]
[null,"VLOGA ZA PRIDOBITEV / SPREMEMBO OKOLJEVARSTVENEGA DOVOLJENJA ZA OBDELAVO ODPADKOV NA PREMIČNI NAPRAVI NA OBMOČJU GRADBIŠČ"]
[null,"Na podlagi 39. člena Uredbe o odpadkih (Uradni list RS, št.  77/22, 113/23 in 13/25), Uredbe o obdelavi odpadkov v premičnih napravah (Uradni list RS, št. 34/08 in 44/22 - ZVO-2) in Uredbe o ravnanju z odpadki, ki nastanejo pri gradbenih delih (Uradni list RS, št. 34/08 in 44/22 - ZVO-2)"]
[null,"Podatki o stranki"]
[null,"Opomba:  (1) - naziv pravne osebe ali samostojnega podjetnika posameznika se navede kot je navedeno v poslovnem registru"]
[null," NAZIV stranke (1):"]
[null," Naslov oziroma sedež:"]
{"$rows_left_out":32}
{"sheet":"pooblasc","index":3,"n_rows":30,"n_cols":10,"rows_kept":30,"cut":false,"hidden":false,"merged":[[24,1,24,13],[25,1,25,13],[26,1,26,13],[20,1,20,3],[20,4,20,13],[21,1,21,3],[21,4,21,13],[23,1,23,13],[17,1,17,13],[18,1,18,3],[18,4,18,8],[18,9,18,13],[19,1,19,3],[19,4,19,13],[1,1,1,13],[3,1,3,3],[3,4,3,13],[4,1,4,3],[4,4,4,13],[6,2,6,3],[6,4,6,13],[7,2,7,3],[7,4,7,13],[10,1,10,3],[10,4,10,13],[15,2,15,3],[15,4,15,13],[2,1,2,13],[11,4,11,13],[12,1,12,3],[12,4,12,13],[13,1,13,3],[13,4,13,13],[14,2,14,3],[14,4,14,13],[8,2,8,3],[8,4,8,13],[11,1,11,3],[9,10,9,13],[5,2,5,3],[5,4,5,13]]}
[]
[null,"Podatki o pooblaščencu, ki zastopa stranko (2)"]
[null,"Opomba:  (2) - rubrika se izpolni le v primeru, če stranko zastopa pooblaščenec; k vlogi mora biti priloženo pooblastilo stranke"]
[null," Ime oz. naziv pooblaščenca:"]
[null," Naslov oziroma sedež:"]
[null,null,"naselje:"]
[null,null,"ulica:"]
[null,null,"hišna številka:"]
[null,null,"pošta:"]
[null,null,"poštna številka:",null,null," "," "," "]
[null,"Davčna številka:"]
[null,"Matična številka:"]
[null,"Zakoniti zastopnik:"]
[null,"Kontaktna oseba:"]
[null,null,"telefon:"]
{"$rows_left_out":16}
{"sheet":"izjava o ne eVročanju","index":4,"n_rows":11,"n_cols":9,"rows_kept":11,"cut":false,"hidden":false,"merged":[[10,1,10,3],[0,0,0,14],[2,0,2,14],[6,8,6,13],[7,5,7,6],[7,8,7,13],[9,1,9,3]]}
["I Z J A V A"]
[]
["Stranka _____________________________, ki jo zastopa ________________________, na podlagi četrtega odstavka 86. člena Zakona o splošnem upravnem postopku (Uradni list RS, št. 24/06 – uradno prečiščeno besedilo, 105/06 – ZUS-1, 126/07, 65/08, 8/10, 82/13, 175/20 – ZIUOPDVE in 3/22 – ZDeb) podaja izjavo, da v zadevi, za katero vlaga predmetno vlogo, želi fizično vročitev vseh dokumentov."]
[]
[]
[]
[]
[null,null,null,null,null,"žig",null,null,"(Ime in priimek zakonitega zastopnika, njegov podpis)"]
[]
["Kraj:"]
["Datum:"]

{"sheet":"1_podatki_o_napravi","index":5,"n_rows":33,"n_cols":2,"rows_kept":33,"cut":false,"hidden":false,"merged":[[1,1,1,2],[32,1,32,2]]}
[]
[null,"1. Podatki o premični napravi za obdelavo gradbenih odpadkov"]
[null,"Naziv naprave:"]
[null,"Največja zmogljivost naprave (tone/uro):"]
[null,"Skupna letna količina predelanih odpadkov (tonah):"]
[null,"ID stavbe iz registra stavb, v primeru predelave v ali ob stavbi*:"]
[null,"a) Opis delov naprave, ki zagotavljajo njeno premičnost"]
[null,"b) Opis pogojev za postavitev premične naprave na mesto obdelave odpadkov "]
[null,"c) Opis odpadkov, ki bodo nastali zaradi obratovanja in vzdrževanja premične naprave, ter način ravnanja z njimi "]
[null,"d) Podatki o emisijah, ki bodo nastajale zaradi obratovanja premične naprave in spremljajoče opreme (hrup, prah, izpušni plini, izcedne vode…)"]
[null,"e) Podatki o izpolnjevanju zahtev predpisov, ki urejajo hrup strojev, uporabljenih na prostem in emisij snovi v zrak iz motorjev z notranjim izgorevanjem vgrajenih v izvencestne premične stroje, če so vgrajenih premično napravo "]
[null,"f) Opis naprave za merjenje emisij in naprav za ugotavljanje obremenjenosti okolja kot posledice emisij iz premične naprave "]
[null,"Predelava bo potekala na območjih gradbišč, ki bodo urejena v skladu z veljavnimi predpisi s področja graditve objektov. V primeru izbire \"da\",  je potrebno za gradbišča izpolniti tudi spodnje rubrike"]
[null,"Vrsta gradbišča, skladno z 2. členom Uredbe o preprečevanju in zmanjševanju emisije delcev iz gradbišč (Uradni list RS, št. 21/11, 197/21 in 44/22 - ZVO-2) (izbrati da ali ne):"]
[null,"- izvajanje gradbenih del traja več kot 12 mesecev, ali"]
{"$rows_left_out":19}
{"sheet":"2_umestitev","index":6,"n_rows":17,"n_cols":6,"rows_kept":17,"cut":false,"hidden":false,"merged":[[2,1,2,6],[3,4,3,6],[1,2,1,6]]}
[]
[null,null,"2. Umestitev premične naprave za obdelavo odpadkov (samo v primeru predelave na prostem nad 30 dni v obdobju 6 mesecev)"]
[]
[null,null,"naziv KO","številka KO","številka parcele"]
[null,null,null,null,null,{"$f":"\"/\"","v":"/"}]
[null,null,null,null,null,{"$f":"\"/\"","v":"/"}]
[null,null,null,null,null,"/"]
[null,null,null,null,null,"/"]
[null,null,null,null,null,"/"]
[null,null,null,null,null,"/"]
[null,null,null,null,null,"/"]
[null,null,null,null,null,"/"]
[null,null,null,null,null,"/"]
[null,null,null,null,null,"/"]
[]
{"$rows_left_out":3}
{"sheet":"3_nenevar_in_nev_odp","index":7,"n_rows":22,"n_cols":7,"rows_kept":22,"cut":false,"hidden":false,"merged":[[2,1,2,4],[1,1,1,5]]}
[]
[null,"3. Podatki o gradbenih odpadkih, ki se bodo obdelovali"]
[]
[null,"Št. odpadka (izbrati iz spustnega seznama)","Nevaren","Naziv odpadka","Postopek predelave","Izvor odpadka"]
[null,null,{"$f":"IF(ISNA(IF(VLOOKUP(B5,SIFRANT_ODPADKOV,3,FALSE)=\"*\",\"*\",\"\")),\"\",IF(VLOOKUP(B5,SIFRANT_ODPADKOV,3,FALSE)=\"*\",\"*\",\"\"))","v":""},{"$f":"IF(ISNA(VLOOKUP(B5,SIFRANT_ODPADKOV,2,FALSE)),\"\",VLOOKUP(B5,SIFRANT_ODPADKOV,2,FALSE))","v":""},null,null,{"$f":"IF(ISNA(OFFSET(ODP_sifrant_r_d!$B$1,MATCH(E5,R_D_POSTOPKI,0),-1)),\"\",OFFSET(ODP_sifrant_r_d!$B$1,MATCH(E5,R_D_POSTOPKI,0),-1))","v":""}]
[null,null,"","",null,null,{"$f":"IF(ISNA(OFFSET(ODP_sifrant_r_d!$B$1,MATCH(E6,R_D_POSTOPKI,0),-1)),\"\",OFFSET(ODP_sifrant_r_d!$B$1,MATCH(E6,R_D_POSTOPKI,0),-1))","v":""}]
[null,null,"","",null,null,{"$f":"IF(ISNA(OFFSET(ODP_sifrant_r_d!$B$1,MATCH(E7,R_D_POSTOPKI,0),-1)),\"\",OFFSET(ODP_sifrant_r_d!$B$1,MATCH(E7,R_D_POSTOPKI,0),-1))","v":""}]
[null,null,"","",null,null,{"$f":"IF(ISNA(OFFSET(ODP_sifrant_r_d!$B$1,MATCH(E8,R_D_POSTOPKI,0),-1)),\"\",OFFSET(ODP_sifrant_r_d!$B$1,MATCH(E8,R_D_POSTOPKI,0),-1))","v":""}]
[null,null,"","",null,null,{"$f":"IF(ISNA(OFFSET(ODP_sifrant_r_d!$B$1,MATCH(E9,R_D_POSTOPKI,0),-1)),\"\",OFFSET(ODP_sifrant_r_d!$B$1,MATCH(E9,R_D_POSTOPKI,0),-1))","v":""}]
[null,null,{"$f":"IF(ISNA(IF(VLOOKUP(B10,SIFRANT_ODPADKOV,3,FALSE)=\"*\",\"*\",\"\")),\"\",IF(VLOOKUP(B10,SIFRANT_ODPADKOV,3,FALSE)=\"*\",\"*\",\"\"))","v":""},{"$f":"IF(ISNA(VLOOKUP(B10,SIFRANT_ODPADKOV,2,FALSE)),\"\",VLOOKUP(B10,SIFRANT_ODPADKOV,2,FALSE))","v":""},null,null,{"$f":"IF(ISNA(OFFSET(ODP_sifrant_r_d!$B$1,MATCH(E10,R_D_POSTOPKI,0),-1)),\"\",OFFSET(ODP_sifrant_r_d!$B$1,MATCH(E10,R_D_POSTOPKI,0),-1))","v":""}]
[null,null,"","",null,null,{"$f":"IF(ISNA(OFFSET(ODP_sifrant_r_d!$B$1,MATCH(E11,R_D_POSTOPKI,0),-1)),\"\",OFFSET(ODP_sifrant_r_d!$B$1,MATCH(E11,R_D_POSTOPKI,0),-1))","v":""}]
[null,null,{"$f":"IF(ISNA(IF(VLOOKUP(B12,SIFRANT_ODPADKOV,3,FALSE)=\"*\",\"*\",\"\")),\"\",IF(VLOOKUP(B12,SIFRANT_ODPADKOV,3,FALSE)=\"*\",\"*\",\"\"))","v":""},{"$f":"IF(ISNA(VLOOKUP(B12,SIFRANT_ODPADKOV,2,FALSE)),\"\",VLOOKUP(B12,SIFRANT_ODPADKOV,2,FALSE))","v":""},null,null,{"$f":"IF(ISNA(OFFSET(ODP_sifrant_r_d!$B$1,MATCH(E12,R_D_POSTOPKI,0),-1)),\"\",OFFSET(ODP_sifrant_r_d!$B$1,MATCH(E12,R_D_POSTOPKI,0),-1))","v":""}]
[null,null,"","",null,null,{"$f":"IF(ISNA(OFFSET(ODP_sifrant_r_d!$B$1,MATCH(E13,R_D_POSTOPKI,0),-1)),\"\",OFFSET(ODP_sifrant_r_d!$B$1,MATCH(E13,R_D_POSTOPKI,0),-1))","v":""}]
[null,null,"","",null,null,{"$f":"IF(ISNA(OFFSET(ODP_sifrant_r_d!$B$1,MATCH(E14,R_D_POSTOPKI,0),-1)),\"\",OFFSET(ODP_sifrant_r_d!$B$1,MATCH(E14,R_D_POSTOPKI,0),-1))","v":""}]
[null,null,"","",null,null,{"$f":"IF(ISNA(OFFSET(ODP_sifrant_r_d!$B$1,MATCH(E15,R_D_POSTOPKI,0),-1)),\"\",OFFSET(ODP_sifrant_r_d!$B$1,MATCH(E15,R_D_POSTOPKI,0),-1))","v":""}]
{"$rows_left_out":8}
{"sheet":"4_po_obdelavi_nastalo","index":8,"n_rows":22,"n_cols":5,"rows_kept":22,"cut":false,"hidden":false,"merged":[[1,1,1,4]]}
[]
[null,"4. Po obdelavi nastali odpadki"]
[]
[null,"Št. odpadka (izbrati iz spustnega seznama)","Nevaren","Naziv odpadka","Odpadek ali preostanek odpadka"]
[null,null,{"$f":"IF(ISNA(IF(VLOOKUP(B5,SIFRANT_ODPADKOV,3,FALSE)=\"*\",\"*\",\"\")),\"\",IF(VLOOKUP(B5,SIFRANT_ODPADKOV,3,FALSE)=\"*\",\"*\",\"\"))","v":{"$error":"#REF!"}},{"$f":"IF(ISNA(VLOOKUP(B5,SIFRANT_ODPADKOV,2,FALSE)),\"\",VLOOKUP(B5,SIFRANT_ODPADKOV,2,FALSE))","v":{"$error":"#REF!"}}]
[null,null,{"$error":"#REF!"},{"$error":"#REF!"}]
[null,null,{"$error":"#REF!"},{"$error":"#REF!"}]
[null,null,{"$error":"#REF!"},{"$error":"#REF!"}]
[null,null,{"$error":"#REF!"},{"$error":"#REF!"}]
[null,null,{"$error":"#REF!"},{"$error":"#REF!"}]
[null,null,{"$error":"#REF!"},{"$error":"#REF!"}]
[null,null,{"$error":"#REF!"},{"$error":"#REF!"}]
[null,null,{"$error":"#REF!"},{"$error":"#REF!"}]
[null,null,{"$error":"#REF!"},{"$error":"#REF!"}]
[null,null,{"$f":"IF(ISNA(IF(VLOOKUP(B15,SIFRANT_ODPADKOV,3,FALSE)=\"*\",\"*\",\"\")),\"\",IF(VLOOKUP(B15,SIFRANT_ODPADKOV,3,FALSE)=\"*\",\"*\",\"\"))","v":{"$error":"#REF!"}},{"$f":"IF(ISNA(VLOOKUP(B15,SIFRANT_ODPADKOV,2,FALSE)),\"\",VLOOKUP(B15,SIFRANT_ODPADKOV,2,FALSE))","v":{"$error":"#REF!"}}]
{"$rows_left_out":8}
{"sheet":"5_obvezne_priloge","index":9,"n_rows":9,"n_cols":4,"rows_kept":9,"cut":false,"hidden":false,"merged":[]}
[]
[null,null,"5. Priloge k vlogi - obvezna priložena dokazila "]
[]
[null,null,"Naziv priloge                                                                                                                                                                                                                                                                                                                                                              "]
[null,null,null,{"$f":"IF(ISNA(VLOOKUP(C5,SIFRANT_PRILOG,3,FALSE)),\"\",VLOOKUP(C5,SIFRANT_PRILOG,3,FALSE))","v":""}]
[null,null,null,{"$f":"IF(ISNA(VLOOKUP(C6,SIFRANT_PRILOG,3,FALSE)),\"\",VLOOKUP(C6,SIFRANT_PRILOG,3,FALSE))","v":""}]
[null,null,null,{"$f":"IF(ISNA(VLOOKUP(C7,SIFRANT_PRILOG,3,FALSE)),\"\",VLOOKUP(C7,SIFRANT_PRILOG,3,FALSE))","v":""}]
[null,null,null,{"$f":"IF(ISNA(VLOOKUP(C8,SIFRANT_PRILOG,3,FALSE)),\"\",VLOOKUP(C8,SIFRANT_PRILOG,3,FALSE))","v":""}]
[null,null,null,{"$f":"IF(ISNA(VLOOKUP(C9,SIFRANT_PRILOG,3,FALSE)),\"\",VLOOKUP(C9,SIFRANT_PRILOG,3,FALSE))","v":""}]

{"sheet":"6_druga_dokazila","index":10,"n_rows":22,"n_cols":3,"rows_kept":22,"cut":false,"hidden":false,"merged":[]}
[]
[null,null,"6. Druga dokazila"]
[]
[null,null,"Dokazilo (naziv dokumenta, št. dokumenta, datuma izdaje, izdajatelja, itd.)"]
[]
[]
[]
[]
[]
[]
[]
[]
[]
[]
[]
{"$rows_left_out":8}
{"sheet":"up_taksa","index":11,"n_rows":23,"n_cols":18,"rows_kept":23,"cut":false,"hidden":false,"merged":[[14,9,14,12],[20,2,20,5],[20,7,20,8],[1,1,1,13],[3,1,3,13],[5,1,5,13],[9,1,9,4],[12,9,12,12],[11,1,11,4],[10,2,10,4],[7,1,7,13]]}
[]
[null,"Upravna taksa:",null,null,null,null,null,null,null,null,null,null,null,null,null,null,"V kolikor se upravna taksa plača na podračun Ministrtva za okolje in prostor, se znesek upravne takse - državne (namen plačila) nakaže na račun št. 0110-0100-0315-637, referenca 11 25704-7111002-35460","."]
[null,null,null,null,null,null,null,null,null,null,null,null,null,null,null,null,{"$f":"MID(YEAR(TODAY()),2,4)","v":"026"},"."]
[null,"Za vlogo je potrebno v skladu s tar.št. 1 in št. 3 taksne tarife Zakona o upravnih taksah (Uradni list RS, št. 106/10-UPB, 14/15-ZUUJFO, 84/15-ZZelP-J, 32/16, 30/18-ZKZaš in 189/20-ZFRO) plačati upravno takso v višini 22,60 EUR. Upravno takso se plača v gotovini ali z drugim veljavnim plačilnim instrumentom in o plačilu predloži ustrezno potrdilo."]
[]
[null,{"$f":"Q2&Q3&\".\"","v":"V kolikor se upravna taksa plača na podračun Ministrtva za okolje in prostor, se znesek upravne takse - državne (namen plačila) nakaže na račun št. 0110-0100-0315-637, referenca 11 25704-7111002-35460026."}]
[]
[null,"TAKSE NE PLAČUJEJO:\n  - država in državni organi,\n  - občine in njihovi organi,\n  - javni skladi, javne agencije ter druge osebe javnega prava itd.\nDruge osebe javnega prava so npr. javna podjetja za opravljanje komunalnih dejavnosti v občinah, javni zavodi (npr. osnovne in srednje šole, bolnišnice, NLZOH), itd."]
[]
[null,"vlogo pripravil-a:"]
[]
[]
[null,null,null,null,null,null,null,null,null,"podpis zakonitega zastopnika ali pooblaščenca"]
[]
[]
{"$rows_left_out":9}
{"sheet":"sifrant_odpadkov","index":12,"n_rows":138,"n_cols":4,"rows_kept":138,"cut":false,"hidden":true,"merged":[]}
["Številka odpadka ","Naziv odpadka ","Nevarnost odpadka","ID"]
["17 01 01","Beton",null,1560]
["17 01 02","Opeke",null,1561]
["17 01 03","Ploščice in keramika",null,1562]
["17 01 06","Mešanice ali ločene frakcije betona, opeke, ploščic in keramike, ki vsebujejo nevarne snovi","*",1109]
["17 01 07","Mešanice betona, opeke, ploščic in keramike, ki niso navedene v 17 01 06",null,1563]
["17 02 01","Les",null,1564]
["17 02 02","Steklo",null,1565]
["17 02 03","Plastika",null,1566]
["17 02 04","Steklo, plastika in les, ki vsebujejo nevarne snovi, ali so z njimi onesnaženi","*",1110]
["17 03 01","Bitumenske mešanice, ki vsebujejo premogov katran","*",1246]
["17 03 02","Bitumenske mešanice, ki niso navedene v 17 03 01",null,1567]
["17 03 03","Premogov katran in proizvodi, ki vsebujejo katran","*",1247]
["17 04 01","Baker, bron, medenina",null,1568]
["17 04 02","Aluminij",null,1569]
{"$rows_left_out":124}
{"sheet":"sifrant_obcine","index":13,"n_rows":212,"n_cols":2,"rows_kept":212,"cut":false,"hidden":true,"merged":[]}
["Naziv občine","OB_ID"]
["AJDOVŠČINA",1]
["ANKARAN",213]
["APAČE",195]
["BELTINCI",2]
["BENEDIKT",148]
["BISTRICA OB SOTLI",149]
["BLED",3]
["BLOKE",150]
["BOHINJ",4]
["BOROVNICA",5]
["BOVEC",6]
["BRASLOVČE",151]
["BRDA",7]
["BREZOVICA",8]
{"$rows_left_out":198}
{"sheet":"sifrant_ostalo","index":14,"n_rows":16,"n_cols":2,"rows_kept":16,"cut":false,"hidden":true,"merged":[]}
["Registracija za izvajanje dejavnosti zbiranja in odvoza odpadkov (na zavihku prosilec)"]
["nenevarni odpadki (38.210)","nenevarni"]
["nevarni odpadki (38.220)","nevarni"]
["nenevarni in nevarni odpadki (38.210 in 38.220)","nenevarni in nevarni"]
[]
["Upravljavec zbirnega centra (izbrati eno od navedenih možnosti):"]
["vlagatelj je upravljavec","Upravjavec"]
["vlagatelj je lastnik in upravljavec","Lastnik in upravljavec"]
[]
["Izbor da/ne"]
["da"]
["ne"]
[]
["Izbor odpadek/preostanek odpadka"]
["odpadek"]
{"$rows_left_out":2}
{"sheet":"sifrant_prilog","index":15,"n_rows":6,"n_cols":7,"rows_kept":6,"cut":false,"hidden":true,"merged":[]}
["ID","SPG_ID","Priloga",null,"Priloga - krajši naziv","ID","SPG_ID"]
[229,149,"01. Načrt ravnanja z odpadki",null,"01. Načrt ravnanja z odpadki",229,149]
[249,191,"02. Dokazilo, da je vlagatelj upravljavec naprave",null,"02. Dokazilo, da je vlagatelj upravljavec naprave",249,191]
[251,189,"03. Dokazila o ukrepih za izpolnjevanje okoljevarstvenih zahtev",null,"03. Dokazila o ukrepih za izpolnjevanje okoljevarstvenih zahtev",251,189]
[291,16,"04. Potrdilo o plačilu upravne takse",null,"04. Potrdilo o plačilu upravne takse",291,16]
[293,39,"05. Pisno pooblastilo stranke pooblaščencu",null,"05. Pisno pooblastilo stranke pooblaščencu",293,39]

{"sheet":"ODP_sifrant_r_d","index":16,"n_rows":16,"n_cols":3,"rows_kept":16,"cut":false,"hidden":true,"merged":[]}
["ID","Šifra","Naziv"]
[46,"R_01","R1 Uporaba načeloma kot gorivo ali drugače za pridobivanje energije"]
[50,"R_02","R2 Pridobivanje topil / regeneracija"]
[51,"R_03","R3 Recikliranje / pridobivanje organskih snovi, ki se ne uporabljajo kot topila (vključno s kompostiranjem ali z drugimi procesi biološkega preoblikovanja"]
[52,"R_04","R4 Recikliranje / pridobivanje kovin in njihovih spojin"]
[53,"R_05","R5 Recikliranje / pridobivanje drugih anorganskih materialov"]
[54,"R_06","R6 Regeneracija kislin ali baz"]
[55,"R_07","R7 Predelava sestavin, ki se uporabljajo za zmanjšanje onesnaževanja"]
[56,"R_08","R8 Predelava sestavin iz katalizatorjev"]
[57,"R_09","R9 Ponovno rafiniranje olja ali druge ponovne uporabe olja"]
[58,"R_10","R10 Vnos v ali na tla v korist kmetijstvu ali za ekološko izboljšanje"]
[59,"R_11","R11 Uporaba odpadkov, pridobljenih s katerimkoli postopkom naštetim pod R1 - R10"]
[60,"R_12","R12 Izmenjava odpadkov za predelavo s katerimkoli postopkom, naštetim pod R1 - R11"]
[1052,"R_12, R_13","R12, R13 Izmenjava odpadkov za predelavo s katerimkoli postopkom, naštetim pod R1 - R11; Skladiščenje odpadkov do enega od postopkov, naštetih pod R1 - R12 (razen začasnega skladiščenja, do zbiranja, na mestu nastanka odpadkov)"]
[61,"R_13","R13 Skladiščenje odpadkov do enega od postopkov, naštetih pod R1 - R12 (razen začasnega skladiščenja, do zbiranja, na mestu nastanka odpadkov)"]
{"$rows_left_out":2}
{"sheet":"prevent_share","index":17,"n_rows":2,"n_cols":3,"rows_kept":2,"cut":false,"hidden":true,"merged":[]}
["a","b","c"]
[1,2,3]